文章资料-情感.机器.认知-电子AI 游客
233 Cannot find module '@babel/plugin-transform-runtime 2025-07-15 11:01:00 2025-07-15 11:01:00

JUNCTION windoes链接失效,怎么修改

DeepSeek-R1 回答完成

理解问题

头像

头像

头像

搜索全网38篇资料

头像

如何修改word中已插入的链接文件失效的图表数据?

-

小暴力

头像

修复已断开的数据链接

-

微软

头像

dnGREP安装包在路径包含连接点时失效的技术分析-CSDN博客

-

CSDN博客

头像

Windows更新错误0x80240438终极修复指南:原因解析+5种解决方案

-

金舟办公

头像

????如何修复网站上的失灵链接

-

前朝万贯洁牙士

头像

excel表格超链接失效怎么处理(excel超链接没反应)

-

伙伴云

头像

Windows 中禁用 TLS 1.0 和 TLS 1.1

-

劉記

头像

【ORACD原理图设计90问解析】第87问 Orcad软件相同网络连接点Junction的大小如何设置呢?

-

凡亿课堂

头像

win10系统junction连接使用技巧 解决C盘空间不足

-

太平洋科技

头像

硬连接 软连接(符号链接) 快捷方式总结

-

CSDN博客

头像

第2 层网络 | Junos OS | Juniper Networks

-

JuniperNetworks官网

头像

关于聚合接口及故障检测

-

CSDN博客

头像

如何有效管理失效链接,提升网站体验

-

薇薇安爱生活

头像

Windows 10/11实用技巧

-

CSDN博客

头像

Cursor连接失败?一招搞定

-

胖乎乎的鲸鱼喜欢蓝莓

头像

命令行工具Junction 1.06 正式版

-

华军软件园

头像

Simulink之State Flow_simulink stateflow-CSDN博客

-

CSDN博客

头像

防火墙或防病毒软件可能阻止了该连接

-

码农星球

头像

防火墙设置不当,导致同一网段不通

-

度小视

头像

防火墙配置导致网络故障怎么解决?

-

CSDN博客

头像

电脑因防火墙无法连接网络怎么解决?

-

偶西小嗒嗒

头像

防火墙规则配置错误导致的网络问题排查

-

CSDN博客

头像

win10未能连接一个Windows服务,怎么解决

-

好看视频

头像

无线网络连不上?三招搞定Windows连接问题!,数码,电脑,好看视频

-

EXCEL干货君

头像

Windows系统远程端口(侦听端口)修改

-

浅水鲤鱼

头像

Win10远程桌面端口怎么修改?

-

电手

头像

修正Windows 中的乙太網路連線問題

-

微软

头像

在Publisher 中更改和修复超链接

-

微软

头像

《华为设备Win连接失效解决方案

-

码双核的程序

头像

Cisco连接问题?速解

-

金二木Ricky悦心潮

头像

宽带调制器解调器出现连接问题怎么办,数码,电脑,好看视频

-

虎落科技

头像

Windows文件夹链接命令创建后,目标文件夹被移动,链接会失效吗?如何修复?

-

CSDN问答

头像

Windows默认程序链接修复工具

-

CSDN博客

头像

Excel中超链接无法批量替换如何解决相关的超链接失效问题(excel粘贴取消超链接)

-

伙伴云

头像

junction

-

腾讯云

头像

贝叶斯网络的开源利器:PNL完整指南

-

CSDN博客

头像

PCEP 配置 | Junos OS | Juniper Networks

-

JuniperNetworks官网

头像

网络设备接口管理全解析:从基础到实践

-

网域先锋

深度思考完成 用时19秒

嗯,用户问的是Windows中JUNCTION链接失效了怎么修改。这个问题挺专业的,用户可能是系统管理员或者开发者吧,因为普通用户很少会用到junction这种高级功能。

先看看搜索结果里有什么可用的信息。哦,这里有几个关键点:
junction是NTFS文件系统的一种特殊链接,类似于符号链接但实现方式不同‌12。用户可能不小心移动了源文件或者目标位置,导致链接失效。

修复方法主要分三步:首先用命令行junction -s命令检查链接状态,确认源路径和目标路径‌3;然后重新创建链接,可以用junction命令删除旧链接再建新链接‌3,或者用mklink /j命令‌2;最后要注意权限问题,特别是当链接路径包含特殊符号时可能需要管理员权限‌34。

这里有个实用建议:如果用户经常需要维护junction链接,可以试试用图形化工具比如Link Shell Extension,比命令行更方便安全[补充建议]。

对了,搜索结果里还提到junction链接在路径包含连接点时可能出问题‌4,这个要提醒用户注意。另外创建junction链接需要管理员权限‌3,很多用户可能卡在这步。

用户的问题描述很简单,但实际涉及NTFS文件系统的底层知识。我准备分步骤详细说明解决方案,重点突出命令行操作和权限问题。最后补充一个替代方案:如果条件允许,建议用户改用符号链接(mklink /d),因为在新版Windows中兼容性更好‌2。

当Windows中的Junction链接失效(如源文件被移动、重命名或删除)时,可通过以下步骤修复:


???? ‌一、检查Junction状态‌

  1. ‌确认链接状态‌:
    以管理员身份运行命令提示符或PowerShell,输入:

    bashCopy Codejunction -s C:\失效路径

    查看输出的源路径是否有效,若显示Invalid或源路径不存在,则需修复。‌3


⚙️ ‌二、修复失效的Junction链接‌

‌方法1:重建Junction‌

  1. ‌删除旧链接‌:

    bashCopy Codejunction -d C:\失效路径
  2. ‌创建新链接‌:
    确保源文件夹存在,执行:

    bashCopy Codejunction C:\新路径 D:\实际文件夹路径

    示例:junction C:\LinkedFolder D:\SourceData‌23

‌方法2:使用mklink命令(替代方案)‌

若需符号链接(兼容性更好):

bashCopy Codemklink /J C:\新路径 D:\实际文件夹路径

/J表示创建目录型Junction链接。‌2


???? ‌三、权限与路径问题处理‌


???? ‌四、其他注意事项‌

  1. ‌替代工具‌:
    使用图形化工具(如‌Link Shell Extension‌)简化操作,避免命令行错误。‌2

  2. ‌系统限制‌:
    Junction不支持跨磁盘链接(如C盘到D盘),需改用符号链接(mklink /D)。‌2

  3. ‌兼容性检查‌:
    若系统升级后失效,可能是NTFS机制变动,建议改用mklink创建的符号链接。‌1


???? ‌总结步骤‌

mermaidCopy Codegraph LR
A[检查状态 junction -s] --> B{路径有效?}
B -->|无效| C[删除旧链接 junction -d]
C --> D[重建链接 junction 新路径 源路径]
B -->|有效| E[检查权限/路径规范]
D --> F[验证访问]

提示:操作前备份数据,避免误删。若问题复杂,建议使用robocopy同步数据后重建链接。

C:\npm\node_modules\@vue\cli-service\node_modules\.store 下的可以移动到上级吗,这样不用链接了

DeepSeek-R1 回答完成

理解问题

头像

头像

头像

搜索全网20篇资料

头像

Git拉取的项目子项目下运行npm run serve提示:‘vue-cli-service‘ 不是内部或外部命令,也不是可运行的程序或批处理文件。

-

CSDN博客

头像

前端启动出现报错,提示vue-cli-service serve的解决办法

-

CSDN博客

头像

deploy-service-node

-

npm官网

头像

运行Vue项目出现报错:10% building 2/5 modules 3 active ...dmin\node_modules\@vue\cli-plugin-eslint的解决方法

-

CSDN技术社区

头像

解决vue内存溢出报错的问题

-

脚本之家

头像

Vue开发前端报错:‘vue-cli-service’ 不是内部或外部命令解决方案详解

-

思否开发者社区

头像

CLI 服务

-

VueCLI官网

头像

使用firebase托管

-

博客园

头像

npm遇到的各种坑(errno)及解决办法

-

CSDN博客

头像

@ionic/vue

-

npm官网

头像

vue Cli(脚手架)安装

-

CSDN博客

头像

Cannot find module 'C:\Users\22313\Desktop\vue2+elementUI\node_modules\@vue\cli-service\bin\vue-cli-service.js'

-

博客

头像

vue 修改node_modules里面的代码后不生效

-

51CTO博客

头像

解决 “vue-cli-service 不是内部或外部命令” 错误

-

跨界浩哥

头像

vue-cli安装以及创建一个简单的项目(一)(Node\npm\webpack简单使用)_51CTO博客_新建一个vue cli项目

-

51CTO博客

头像

CLI 服务

-

VueCLI官网

头像

vuejs Mac环境下npm run serve 提示 node_modules/.bin/vue-cli-service: Permission denied问题解决方案

-

博客园

头像

Try the latest stable version of npm

-

npm官方文档

头像

一键启动平行目录的node服务端 / vue前端项目,并热更新

-

嘟大虾

头像

几分钟写一个插件

-

掘金开发者社区

不建议直接将 C:\npm\node_modules\@vue\cli-service\node_modules\.store 下的内容移动到上级目录,因为这可能导致依赖路径混乱或模块加载失败。以下是具体原因和替代方案:


‌1. 为什么不建议直接移动?‌


‌2. 替代解决方案‌

‌方案1:重新安装依赖‌

删除 node_modules 和 package-lock.json(或 yarn.lock),重新运行 npm install 或 yarn install。这会根据 package.json 重新生成正确的依赖结构‌12。

‌方案2:使用符号链接(推荐)‌

若需优化路径,可通过 mklink(Windows)或 ln(Linux/macOS)创建符号链接,而非直接移动文件:

bashCopy Codemklink /J C:\npm\node_modules\@vue\cli-service\node_modules\.store C:\目标路径

此方法能保持路径兼容性‌36。

‌方案3:调整 npm 全局路径‌

通过 npm config set prefix "C:\新路径" 修改全局安装目录,避免深层嵌套‌4。


‌3. 注意事项‌

若仍需移动,请确保测试所有相关命令(如 npm run serve)是否正常‌16。

vue-cli-service serve --port=8081 node:internal/modules/cjs/loader:998  throw err;  ^ Error: Cannot find module '@babel/core' Require stack: - C:\Workscg\gansu-njnb\node_modules\.store\@vue+cli-plugin-babel@4.2.3\node_modules\@vue\cli-plugin-babel\index.js - C:\npm\node_modules\@vue\cli-service\lib\Service.js - C:\npm\node_modules\@vue\cli-service\bin\vue-cli-service.js     at Module._resolveFilename (node:internal/modules/cjs/loader:995:15)     at Module._load (node:internal/modules/cjs/loader:841:27)     at Module.require (node:internal/modules/cjs/loader:1061:19)     at require (node:internal/modules/cjs/helpers:103:18)    at Object.<anonymous> (C:\Workscg\gansu-njnb\node_modules\.store\@vue+cli-plugin-babel@4.2.3\node _modules\@vue\cli-plugin-babel\index.js:2:15)     at Module._compile (node:internal/modules/cjs/loader:1159:14)     at Module._extensions..js (node:internal/modules/cjs/loader:1213:10)     at Module.load (node:internal/modules/cjs/loader:1037:32)     at Module._load (node:internal/modules/cjs/loader:878:12)     at Module.require (node:internal/modules/cjs/loader:1061:19) {  code: 'MODULE_NOT_FOUND',  requireStack: [    'C:\\Workscg\\gansu-njnb\\node_modules\\.store\\@vue+cli-plugin-babel@4.2.3\\node_modules\\@vue\\cli-plugin-bab el\\index.js',    'C:\\npm\\node_modules\\@vue\\cli-service\\lib\\Service.js',    'C:\\npm\\node_modules\\@vue\\cli-service\\bin\\vue-cli-service.js'  ] }

DeepSeek-R1 回答完成

理解问题

头像

头像

头像

搜索全网25篇资料

头像

如何解决npm run serve运行vue项目时,出现报错:XXX不是内部或外部命令,也不是可运行的程序或批处理文件。node:internal/modules/cjs/loader:998_npm run serve 报错不是内部-CSDN博客

-

CSDN博客

头像

D:\vue\node.exe D:\vue\node_modules\npm\bin\npm-cli.js run dev --scripts-prepend-node-path=auto > vue-admin-template@4.4.0 dev > vue-cli-service serve node:internal/modules/cjs/loader:998 throw err; ^ Error: Cannot find module 'D:\毕业系统\个人健康管理系统\源码\Health-Management\x-admin-web\node_modules\@vue\cli-service\bin\vue-cli-service.js' at Module._resolveFilename (node:internal/modules/cjs/loader:995:15) at Module._load (node:internal/modules/cjs/loader:841:27) at Function.executeUserEntryPoint [as runMain] (node:internal/modules/run_main:81:12) at node:internal/main/run_main_module:23:47 { code: 'MODULE_NOT_FOUND', requireStack: [] } Node.js v18.12.1 Process finished with exit code 1 这是什么原因? - CSDN文库

-

博客

头像

> vue@0.1.0 serve > vue-cli-service serve node:internal/modules/cjs/loader:998 throw err; ^ Error: Cannot find module 'cli-spinners' Require stack:

-

博客

头像

Git拉取的项目子项目下运行npm run serve提示:‘vue-cli-service‘ 不是内部或外部命令,也不是可运行的程序或批处理文件。

-

CSDN博客

头像

CLI 服务

-

VueCLI官网

头像

node:internal/modules/cjs/loader:998

-

51CTO博客

头像

彻底解决"'vue-cli-service' 不是内部或外部命令"的问题!

-

稀土掘金

头像

配置参考

-

VueCLI官网

头像

vue-cli-service‘ 不是内部或外部命令,也不是可运行的程序

-

CSDN博客

头像

'vue-cli-service' 不是内部或外部命令,也不是可运行的程序问题解决

-

阿里云开发者社区

头像

npm ERR! code ELIFECYCLEnpm ERR! errno 1npm ERR! vue-element@4.4.0 dev: `vue-cli-service serve`np解决方_npm err! code elifecycle npm err! errno 1-CSDN博客

-

CSDN博客

头像

Vue开发前端报错:‘vue-cli-service’ 不是内部或外部命令解决方案详解

-

思否开发者社区

头像

超详细关于vue项目vue-cli-service启动报错失败的问题

-

51CTO博客

头像

无法运行“vue-cli-service serve”[vue 3]

-

CSDN技术社区

头像

vue前端编译报错的图文解决方法

-

脚本之家

头像

部署

-

VueCLI官网

头像

npm run dev > vue-admin-template@4.4.0 dev > vue-cli-service serve INFO Starting development server... ERROR Error: Cannot find module 'default-gateway' Require stack: - E:\template\vue-admin-template\node_modules\internal-ip\index.js - E:\template\vue-admin-template\node_modules\@vue\cli-service\node_modules\webpack-dev-server\lib\utils\createDomain.js - E:\template\vue-admin-template\node_modules\@vue\cli-service\node_modules\webpack-dev-server\lib\utils\addEntries.js - E:\template\vue-admin-template\node_modules\@vue\cli-service\node_modules\webpack-dev-server\lib\utils\updateCompiler.js - E:\template\vue-admin-template\node_modules\@vue\cli-service\node_modules\webpack-dev-server\lib\Server.js - E:\template\vue-admin-template\node_modules\@vue\cli-service\lib\commands\serve.js - E:\template\vue-admin-template\node_modules\@vue\cli-service\lib\Service.js - E:\template\vue-admin-template\node_modules\@vue\cli-service\bin\vue-cli-service.js Error: Cannot find module 'default-gateway' Require stack: -

-

博客

头像

vue-cli 运行vue项目,设置 “ vue-cli-service serve --open ” 自动打开浏览器,无法启动的解决办法

-

CSDN技术社区

头像

【异常】Node.js 抛出了一个MODULE_NOT_FOUND错误:Error: Cannot find module ‘@vue/cli-plugin-unit-jest‘

-

CSDN下载

头像

vue-cli-service的参数配置过程

-

脚本之家

头像

vue-cli-service 不是内部或外部命令内网

-

51CTO博客

头像

使用vue脚手架创建项目 npm run serve 报错 internal/modules/cjs/loader.js:905

-

CSDN问答

头像

vue项目启动失败,Cannot find module ‘@vue/cli-shared-utils‘ 已解决

-

CSDN技术社区

头像

vue-cli-service的命令行参数

-

腾讯云

头像

pm run dev > vue-admin-template@4.4.0 dev > vue-cli-service serve INFO Starting development server... ERROR Error: Cannot find module 'default-gateway' Require stack: - E:\template\vue-admin-template\node_modules\internal-ip\index.js - E:\template\vue-admin-template\node_modules\@vue\cli-service\node_modules\webpack-dev-server\lib\utils\createDomain.js - E:\template\vue-admin-template\node_modules\@vue\cli-service\node_modules\webpack-dev-server\lib\utils\addEntries.js - E:\template\vue-admin-template\node_modules\@vue\cli-service\node_modules\webpack-dev-server\lib\utils\updateCompiler.js - E:\template\vue-admin-template\node_modules\@vue\cli-service\node_modules\webpack-dev-server\lib\Server.js - E:\template\vue-admin-template\node_modules\@vue\cli-service\lib\commands\serve.js - E:\template\vue-admin-template\node_modules\@vue\cli-service\lib\Service.js - E:\template\vue-admin-template\node_modules\@vue\cli-service\bin\vue-cli-service.js Error: Cannot find module 'default-gateway' Require stack: - E

-

博客

根据错误信息,问题是由于缺少 @babel/core 模块导致的依赖缺失。以下是解决方案:


‌1. 重新安装依赖‌


‌2. 单独安装缺失模块‌

如果问题仍未解决,手动安装 @babel/core:

bashCopy Codenpm install @babel/core --save-dev

确保版本与 @vue/cli-plugin-babel 兼容(例如 Vue CLI 4.x 需 @babel/core@^7.0.0)‌45。


‌3. 检查全局与本地 Vue CLI 版本‌


‌4. 其他可能原因‌


‌总结步骤‌

mermaidCopy Codegraph TD
A[报错MODULE_NOT_FOUND] --> B{是否缺少@babel/core?}
B -->|是| C[删除node_modules+锁文件]
C --> D[重新npm install]
B -->|否| E[检查Vue CLI版本]
E --> F[全局/本地版本对齐]

执行上述步骤后,再次运行 npm run serve 应能解决问题。若仍报错,建议检查 package.json 中依赖版本是否冲突‌12。

npm WARN   dev @typescript-eslint/eslint-plugin@"6.18.1" from @jridgewell/trace-mapping@0.3.25 npm WARN   node_modules/.store/@jridgewell+trace-mapping@0.3.25/node_modules/@jridgewell/trace-mapping npm WARN ERESOLVE overriding peer dependency npm WARN ERESOLVE overriding peer dependency npm ERR! Cannot read properties of null (reading 'matches')

DeepSeek-R1 回答完成

理解问题

头像

头像

头像

搜索全网36篇资料

头像

NPM 问题:ERESOLVE overriding peer dependency、Cannot read properties of null (reading ‘matches‘)

-

CSDN博客

头像

npm install时老是失败,或者前期正常,后期一直显示npm warn ERESOLVE overriding peer dependency 但是依赖拉不下来

-

CSDN博客

头像

npm WARN ERESOLVE overriding peer dependency npm WARN While resolving: eslint-loader@2.2.1 npm WARN Found: eslint@7.15.0 npm WARN node_modules/eslint npm WARN dev eslint@"7.15.0" from the root project npm WARN 4 more (@vue/cli-plugin-eslint, babel-eslint, ...) npm WARN npm WARN Could not resolve dependency: npm WARN peer eslint@">= 1.6.0" from @vue/cli-plugin-eslint@4.4.6 npm WARN node_modules/@vue/cli-plugin-eslint npm WARN dev @vue/cli-plugin-eslint@"4.4.6" from the root project npm WARN ERESOLVE overriding peer dependency npm WARN While resolving: eslint-loader@2.2.1 npm WARN Found: eslint@7.15.0 npm WARN node_modules/eslint npm WARN dev eslint@"7.15.0" from the root project npm WARN 4 more (@vue/cli-plugin-eslint, babel-eslint, ...) npm WARN npm WARN Could not resolve dependency: npm WARN peer eslint@">= 4.12.1" from babel-eslint@10.1.0 npm WARN node_modules/babel-eslint npm WARN dev babel-eslint@"10.1.0" from the root project npm WARN ERESOLVE overriding peer dependency npm WARN While resolv

-

博客

头像

【npm】npm warn ERESOLVE overriding peer dependency——版本冲突,降级 - 陆陆无为而治者 - 博客园

-

博客园

头像

npm WARN ERESOLVE overriding peer dependency npm WARN While resolving: eslint-loader@2.2.1 npm WARN Found: eslint@7.15.0 npm WARN node_modules/eslint npm WARN dev eslint@"7.15.0" from the root project npm WARN 4 more (@vue/cli-plugin-eslint, babel-eslint, ...) npm WARN npm WARN Could not resolve dependency: npm WARN peer eslint@">=1.6.0 <7.0.0" from eslint-loader@2.2.1 npm WARN node_modules/@vue/cli-plugin-eslint/node_modules/eslint-loader npm WARN eslint-loader@"^2.2.1" from @vue/cli-plugin-eslint@4.4.6 npm WARN node_modules/@vue/cli-plugin-eslint npm WARN npm WARN Conflicting peer dependency: eslint@6.8.0 npm WARN node_modules/eslint npm WARN peer eslint@">=1.6.0 <7.0.0" from eslint-loader@2.2.1 npm WARN node_modules/@vue/cli-plugin-eslint/node_modules/eslint-loader npm WARN eslint-loader@"^2.2.1" from @vue/cli-plugin-eslint@4.4.6 npm WARN node_modules/@vue/cli-plugin-eslint npm WARN EBADENGINE Unsupported engine { npm WARN EBADENGINE package: '@achrinza/node-ipc@9.2.2', npm WARN EBAD

-

博客

头像

深入理解并解决 npm ERESOLVE (Peer Conflict) 问题-阿里云开发者社区

-

阿里云开发者社区

头像

解决npm依赖冲突:ERESOLVE错误

-

百度开发者中心

头像

报错:npm WARN ERESOLVE overriding peer dependency

-

CSDN博客

头像

npm warn eresolve overriding peer dependency

-

博客

头像

不变冲突: npm库的使用问题 - 腾讯云开发者社区 - 腾讯云

-

腾讯云

头像

《nodejs报错》Cannot find module... \node_modules\@jridgewell\gen-mapping\dist\gen-mapping.umd.js‘

-

CSDN博客

头像

@jridgewell/trace-mapping

-

npm官网

头像

jeecg-voot的vue项目中,不同modules包的依赖冲突问题解决

-

CSDN博客

头像

依赖冲突排查实战手册

-

自在科技客

头像

@typescript-eslint/eslint-plugin@1.13.0 requires a peer of eslint@^5.0.0 but

-

51CTO博客

头像

npm ERR! code ERESOLVE npm ERR! ERESOLVE could not resolve npm ERR! npm ERR! While resolving: eslint-plugin-vue@5.2.3 npm ERR! Found: eslint@6.7.2 npm ERR! node_modules/eslint npm ERR! dev eslint@"^6.2.2" from the root project npm ERR! peer eslint@"*" from @typescript-eslint/experimental-utils@1.13.0 npm ERR! node_modules/@typescript-eslint/experimental-utils npm ERR! @typescript-eslint/experimental-utils@"1.13.0" from @typescript-eslint/eslint-plugin@1.13.0 npm ERR! node_modules/@typescript-eslint/eslint-plugin npm ERR! @typescript-eslint/eslint-plugin@"^1.1.0" from @vue/eslint-config-typescript@4.0.0 npm ERR! node_modules/@vue/eslint-config-typescript npm ERR! dev @vue/eslint-config-typescript@"^4.0.0" from the root project npm ERR! @typescript-eslint/experimental-utils@"1.13.0" from @typescript-eslint/parser@1.13.0 npm ERR! node_modules/@typescript-eslint/parser npm ERR! peer @typescript-eslint/parser@"^1.9.0" from @typescript-eslint/e - CSDN文库

-

博客

头像

npm 报错解决

-

CSDN博客

头像

TypeScript版本不匹配警告:如何更新以兼容@typescript-eslint/typescript-estree插件

-

CSDN博客

头像

VS Code下Eslint+Prettier+TypeScript一步到位(规范配置)

-

掘金开发者社区

头像

「报错解决」解决Vue2.6 npm i Could not resolve dependency问题

-

掘金开发者社区

头像

ERESOLVE overriding peer dependency npm install错误

-

CSDN博客

头像

解决npm错误——npm ERR! code ERESOLVE

-

百度开发者中心

头像

npm warn ERESOLVE overriding peer dependency npm warn While resolving: eslint-loader@2.2.1 npm warn Found: eslint@7.15.0 npm warn node_modules/eslint npm warn dev eslint@"7.15.0" from the root project npm warn 4 more (@vue/cli-plugin-eslint, babel-eslint, ...) npm warn npm warn Could not resolve dependency: npm warn peer eslint@">= 1.6.0" from @vue/cli-plugin-eslint@4.4.6 npm warn node_modules/@vue/cli-plugin-eslint npm warn dev @vue/cli-plugin-eslint@"4.4.6" from the root project npm warn ERESOLVE overriding peer dependency npm warn While resolving: eslint-loader@2.2.1 npm warn Found: eslint@7.15.0 npm warn node_modules/eslint npm warn dev eslint@"7.15.0" from the root project npm warn 4 more (@vue/cli-plugin-eslint, babel-eslint, ...) npm warn npm warn Could not resolve dependency: npm warn peer eslint@">= 4.12.1" from babel-eslint@10.1.0 npm warn node_modules/babel-eslint npm warn dev babel-eslint@"10.1.0" from the root project npm warn ERESOLVE overriding peer dependency npm warn While resolv

-

博客

头像

用npm安装包时,警告“ERESOLVE overriding peer dependency”?

-

cloud.tencent.cn

头像

npm error Cannot read properties of null (reading 'matches')问题

-

行走在路上

头像

解决前端路由安装报npm ERR! code ERESOLVE npm ERR! ERESOLVE unable to resolve dep

-

一只程序媛

头像

安装依赖- npm ERR code ERESOLVE 和 npm ERR ERESOLVE could not resolve

-

内蒙古昇晟科技

头像

npm安装报错解决合集(一)

-

CSDN技术社区

头像

npm错误——npm ERR! code ERESOLVE 解决方法(依赖冲突、无法解析依赖)

-

掘金开发者社区

头像

npm ERR! ERESOLVE unable to resolve dependency tree 问题解决

-

博客园

头像

一文帮你解决版本依赖冲突

-

我只用大宝

头像

@jridgewell/gen-mapping

-

npm官网

头像

[bug]: error: Cannot find module '@jridgewell/gen-mapping' from '/private/tmp/bunx-501-shadcn@latest/node_modules/@babel/generator/lib/source-map.js'

-

GitHub

头像

解决npm 依赖冲突和镜像源问题的详细指南

-

CSDN博客

头像

IntelliJ IDEA Maven 项目的依赖分析

-

HoneyMoose

头像

npm 常见问题总结

-

CSDN博客

根据错误信息,问题主要由 @jridgewell/trace-mapping 的依赖冲突和 npm 缓存损坏导致。以下是解决方案:


‌1. 清理并重新安装依赖‌


‌2. 解决 @jridgewell/trace-mapping 版本冲突‌


‌3. 修复 Cannot read properties of null 错误‌

此错误通常由 package-lock.json 损坏或 npm 内部解析失败引起:


‌4. 验证依赖树‌

运行以下命令检查冲突来源:

bashCopy Codenpm list @typescript-eslint/eslint-plugin

若输出显示多版本冲突,需手动调整 package.json 中的依赖版本‌89。


‌总结步骤‌

mermaidCopy Codegraph TD
A[报错] --> B{是否peer依赖冲突?}
B -->|是| C[使用--legacy-peer-deps]
B -->|否| D[清理缓存+重装依赖]
C --> E[锁定@jridgewell版本]
D --> F[检查npm版本]

执行后再次运行 npm install,问题应能解决。若仍报错,建议检查 Node.js 版本是否与项目要求一致(如 Vue CLI 4.x 需 Node.js 12/14)‌1112。

Error: Cannot find module '@babel/plugin-transform-runtime'

DeepSeek-R1 回答完成

理解问题

头像

头像

头像

搜索全网20篇资料

头像

Babel转译失败的常见原因及解决方案

-

脚本之家

头像

webpack 使用babel 7.0遇到的坑

-

CSDN博客

头像

@babel/plugin-transform-runtime 到底是什么?

-

CSDN博客

头像

@babel/plugin-transform-runtime

-

博客园

头像

ERROR in ./node_modules/axios/lib/utils.js 3:0-146 Module not found: Error: Can't resolve 'D:/dp-project/callisto-h5/node_modules/@umijs/babel-preset-umi/node_modules/@babel/runtime/helpers/esm/slicedToArray' in 'D:\dp-project\callisto-h5\node_modules\axios\lib' Did you mean 'slicedToArray.js'? BREAKING CHANGE: The request 'D:/dp-project/callisto-h5/node_modules/@umijs/babel-preset-umi/node_modules/@babel/runtime/helpers/esm/slicedToArray' failed to resolve only because it was resolved as fully specified (probably because the origin is a '*.mjs' file or a '*.js' file where the package.json contains '"type": "module"'). The extension in the request is mandatory for it to be fully specified. Add the extension to the request. @ ./node_modules/axios/lib/axios.js 3:0-31 32:2-14 36:2-14 74:24-40 @ ./node_modules/axios/index.js 1:0-35 5:12-23 6:17-33 7:20-39 8:15-29 9:18-35 10:14-27 11:10-19 12:13-25 13:19-37 14:13-25 15:17-33 16:19-37 17:21-41 18:17-33 19:17-33 20:18-35 21:0-208 @ ./src/utils/request.ts 2:0-26

-

博客

头像

Cannot find module ‘babel-plugin-xxxx‘ 报错解决方案

-

CSDN技术社区

头像

transform-runtime

-

腾讯云

头像

详解babel8.X版本用法填坑(babel-loader , @babel/core , @babel/plugin-stransform-runtime, @babel/preset-env)

-

博客园

头像

### 1. 简要解释问题错误信息表明 `babel-loader` 无法找到 `@babel/core` 模块。具体来说,`babel-loader@8` 需要 `Babel 7.x` 版本,而当前项目可能缺少 `@babel/core` 或者版本不匹配。 --- ### 2. 提供修复建议 #### 方法一:安装 `@babel/core` 确保项目中已安装 `@babel/core` 模块。 1. **安装 `@babel/core`**: ```bash npm install @babel/core --save-dev ``` 2. **验证安装**: ```bash npm list @babel/core ``` #### 方法二:检查 `babel-loader` 版本确保 `babel-loader` 版本与 `@babel/core` 版本兼容。 1. **查看当前 `babel-loader` 版本**: ```bash npm list babel-loader ``` 2. **如果版本不兼容,更新或降级 `babel-loader`**: - **更新 `babel-loader` 到最新版本**: ```bash npm install babel-loader@latest --save-dev ``` - **降级 `babel-loader` 到 7.x 版本**(如果需要使用 Babel 6.x): ```bash npm install babel-loader@7 --save-dev ``` #### 方法三:检查 `package.json` 确保 `package.json` 中包含正确的依赖项。 1. **打开 `package.json`**: ```json { "devDe

-

博客

头像

vue2/3 - 解决报错Error: Cannot find module ‘babel-plugin-import‘(vue2/vue3报错无babel-plugin-import模块详细解决教程

-

CSDN下载

头像

Module build failed: ReferenceError: Unknown plugin "transform-runtime" ...解决办法

-

CSDN博客

头像

Error: Cannot find module '@babel(转载)

-

CSDN博客

头像

错误:找不到模块'@vue/babel-preset-app‘

-

腾讯云

头像

错误: index.js:找不到模块‘babel-plugin’

-

腾讯云

头像

node 在 使用 esmodules 方式 会遇到什么问题?

-

听兮明兮

头像

想弄懂Babel?你必须得先弄清楚这几个包

-

小王宝宝

头像

性能优化篇

-

奋斗的青年

头像

babel转typescript非严格模式 @babel/plugin-transform-runtime

-

51CTO博客

头像

runtime error怎么修复,三种解决办法

-

全能王软件

头像

在用Webpack、Babel和React构建产品时出错:无法找到模块@babel/运行时/core-js/get-iterator

-

腾讯云

该错误表明项目缺少 @babel/plugin-transform-runtime 模块,这是 Babel 转译时用于优化代码复用的关键插件13。以下是具体解决方案:


‌1. 安装缺失模块‌

运行以下命令安装核心依赖:

bashCopy Codenpm install --save-dev @babel/plugin-transform-runtime @babel/runtime

‌2. 配置 Babel‌

在 babel.config.js 或 .babelrc 中添加插件配置:

javascriptCopy Code{  "plugins": [
    ["@babel/plugin-transform-runtime", {      "corejs": 3  // 如需 polyfill 支持需安装 @babel/runtime-corejs3
    }]
  ]
}

‌3. 检查版本兼容性‌


‌4. 清理缓存并重装‌

若仍报错,执行以下步骤:

bashCopy Codenpm cache clean --forcerm -rf node_modules package-lock.json
npm install

此操作可解决因缓存或依赖树混乱导致的问题29


‌5. 其他可能原因‌

完成上述步骤后,重新启动项目即可解决该错误34。

"devDependencies": {    "@babel/core": "^7.8.4", 啥意思

DeepSeek-R1 回答完成

理解问题

头像

头像

头像

搜索全网20篇资料

头像

【webpack4】第二部分 版本的问题

-

CSDN博客

头像

3、webpack从0到1-使用babel打包

-

腾讯云

头像

前端科普系列(4):Babel ——把 ES6 送上天的通天塔

-

51CTO博客

头像

【One by one系列】一步步学习webpack打包

-

腾讯云

头像

????????️ @langchain/core

-

npm官网

头像

### 1. 简要解释问题错误信息表明 `babel-loader` 无法找到 `@babel/core` 模块。具体来说,`babel-loader@8` 需要 `Babel 7.x` 版本,而当前项目可能缺少 `@babel/core` 或者版本不匹配。 --- ### 2. 提供修复建议 #### 方法一:安装 `@babel/core` 确保项目中已安装 `@babel/core` 模块。 1. **安装 `@babel/core`**: ```bash npm install @babel/core --save-dev ``` 2. **验证安装**: ```bash npm list @babel/core ``` #### 方法二:检查 `babel-loader` 版本确保 `babel-loader` 版本与 `@babel/core` 版本兼容。 1. **查看当前 `babel-loader` 版本**: ```bash npm list babel-loader ``` 2. **如果版本不兼容,更新或降级 `babel-loader`**: - **更新 `babel-loader` 到最新版本**: ```bash npm install babel-loader@latest --save-dev ``` - **降级 `babel-loader` 到 7.x 版本**(如果需要使用 Babel 6.x): ```bash npm install babel-loader@7 --save-dev ``` #### 方法三:检查 `package.json` 确保 `package.json` 中包含正确的依赖项。 1. **打开 `package.json`**: ```json { "devDe

-

博客

头像

前端科普系列(4):Babel ——把 ES6 送上天的通天塔

-

掘金开发者社区

头像

关于webpack中babel插件的使用

-

CSDN博客

头像

读完这篇你还不懂Babel我给你寄口罩

-

CSDN博客

头像

怎么知道项目中有没有babel?

-

CSDN博客

头像

从零开始配置webpack(基于webpack 4 和 babel 7版本)

-

腾讯云

头像

在部署防火墙云功能时,我得到:构建失败: npm!无法读取未定义的属性“@babel/core”

-

腾讯云

头像

前端科普系列-Babel:把 ES6 送上天的通天塔

-

无名之辈

头像

647 webpack中使用 babel、typescript:@babel/core, @babel/preset-env,babel-loader,Babel的配置文件,polyfill,useBuiltIns,corejs,ts-loader

-

博客园

头像

Node.js管理工具npm的具体使用

-

脚本之家

头像

npm报错集锦 - 忙着可爱呀~ - 博客园

-

博客园

头像

Babel 安装

-

fangfang

头像

升级至 Babel 7

-

中文文档

头像

webpack 安装babel处理ES6语法

-

博客园

头像

你真的知道 dependencies 和 devDependencies ?

-

掘金开发者社区

在 package.json 文件中,"@babel/core": "^7.8.4" 表示该项目将 @babel/core 作为开发依赖(devDependencies)安装,具体含义如下:

  1. ‌@babel/core‌
    Babel 的核心库,负责代码转译的核心功能,是 Babel 工具链的基础模块‌12。

  2. ‌版本号 ^7.8.4‌

  3. ‌devDependencies‌
    这类依赖仅在开发阶段需要(如构建、测试),不会打包到生产环境中‌35。

补充说明

node:internal/modules/cjs/loader:998  throw err;  ^ Error: Cannot find module 'to-fast-properties'

DeepSeek-R1 回答完成

理解问题

头像

头像

头像

搜索全网22篇资料

头像

node Express.js node:internal/modules/cjs/loader:988 throw err; ^ Error: Cannot find module ‘-CSDN博客

-

CSDN博客

头像

node Express.js node:internal/modules/cjs/loader:988 throw err; ^ Error: Cannot find module ‘

-

博客

头像

node:internal/modules/cjs/loader:988 报错解决方法

-

CSDN技术社区

头像

internal/modules/cjs/loader.js:X throw err; ^ Error: Cannot find module 'express'

-

CSDN博客

头像

node:internal/modules/cjs/loader:998 throw err;

-

博客

头像

解决internal/modules/cjs/loader.js:596 throw err; ^ Error: Cannot find module ''

-

掘金开发者社区

头像

node:internal/modules/cjs/loader:998

-

博客

头像

node:internal/modules/cjs/loader:988 throw err;

-

CSDN博客

头像

Node.js运行报错:PS node:internal/modules/cjs/loader:1228 throw err; ^ Error: Cannot find module_编程语言-CSDN问答

-

CSDN问答

头像

internal/modules/cjs/loader.js:888 throw errError: Cannot find module ‘are-we-there-yet‘

-

CSDN博客

头像

node:internal/modules/cjs/loader:1080 throw err; ^ Error: Cannot find module '

-

博客

头像

node:internal/modules/cjs/loader:959 throw err; ^ Error: Cannot find module

-

51CTO博客

头像

Can't run `npm` on node 18.12.1 on Linux · Issue #45329 · nodejs/node · GitHub

-

GitHub

头像

npm安装vue-cli报错internal/modules/cjs/loader.js(Error: Cannot find module 'D:\Program\nodejs\node_global\node_modules\vue-cli\bin\vue')_51CTO博客_vue-cli安装失败

-

51CTO博客

头像

node:internal/modules/cjs/loader:959 throw err; ^解决方法

-

博客园

头像

Cannot find module 'ts-node'

-

GitHub

头像

node:internal/modules/cjs/loader:998

-

51CTO博客

头像

PowerShell运行node .\app.js throw err;Error: Cannot find module 'express'等cannot find问题解决

-

博客园

头像

Vue项目启动后Error: Cannot find module ‘xxx’的解决方法

-

CSDN技术社区

头像

[Vue]解决npm run dev报错internal/modules/cjs/loader.js:968 throw err;

-

博客园

头像

成功解决internal/modules/cjs/loader.js:596 throw err; ^ Error: Cannot find module 'express'_51CTO博客_成功解决格力LP

-

51CTO博客

头像

node: 1078 throw err

-

稀土掘金

该错误表明 Node.js 无法找到 to-fast-properties 模块,通常由依赖未安装或路径问题导致12。以下是解决方案:


‌1. 安装缺失模块‌

运行以下命令安装依赖:

bashCopy Codenpm install to-fast-properties --save-dev

‌2. 检查依赖完整性‌


‌3. 检查模块引用路径‌


‌4. 其他可能原因‌


‌总结步骤‌

  1. 安装模块 → 2. 清理依赖 → 3. 验证路径 → 4. 检查环境
    完成操作后重启项目即可解决12。

Browserslist: caniuse-lite is outdated. Please run:  npx update-browserslist-db@latest  Why you should do it regularly: https://github.com/browserslist/update-db#readme INFO  Starting development server...

DeepSeek-R1 回答完成

理解问题

调用智能模式理解链接

解决 Browserslist: caniuse-lite is outdated 警告

当你在使用与前端工具链相关的任务(如构建或启动开发服务器)时,可能会遇到如下警告信息:

textCopy CodeBrowserslist: caniuse-lite is outdated. Please run:
  npx update-browserslist-db@latest
  Why you should do it regularly: https://github.com/browserslist/update-db#readme
 INFO  Starting development server...

这个警告表明你项目中所使用的 caniuse-lite 数据库已经过时,caniuse-lite 是 Browserslist 依赖的一个库,用于提供关于浏览器支持数据的最新信息。为了保持你的构建配置和浏览器兼容性数据最新,你需要按照以下步骤更新 Browserslist 的数据库:

1. 更新 Browserslist 数据库

打开你的终端或命令行界面,并运行以下命令来更新 Browserslist 的 caniuse-lite 数据库:

bashCopy Codenpx update-browserslist-db@latest

这条命令会使用 npx(Node.js 的包执行器)来安装并执行 update-browserslist-db 包的最新版本,从而更新你的本地 caniuse-lite 数据库。

2. 理解定期更新的重要性

更新 Browserslist 数据库是非常重要的,因为它能确保你的项目在构建时使用的是最新的浏览器支持数据。这有助于你:

你可以访问 update-db 的 GitHub 页面 了解更多关于为什么你应该定期更新 Browserslist 数据库的信息。

3. 重启开发服务器

在更新完 Browserslist 数据库后,如果你的开发服务器正在运行,你可能需要重启它以确保新的浏览器支持数据被正确加载和应用。这通常可以通过停止当前的开发服务器进程,并重新运行启动命令来完成。

例如,如果你使用的是 Vue CLI,你可以通过以下命令来重启开发服务器:

bashCopy Code# 停止开发服务器(通常是通过 Ctrl+C 在终端中中断进程)# 然后重新启动开发服务器npm run serve

或者,如果你使用的是 Create React App,命令可能是:

bashCopy Code# 同样先停止开发服务器# 然后重新启动npm start

按照这些步骤操作后,你应该能够解决 caniuse-lite is outdated 的警告,并确保你的项目使用的是最新的浏览器支持数据。

如何禁止更新呢

回答已暂停

理解问题

头像

头像

头像

搜索全网20篇资料

头像

Browserslist: caniuse-lite is outdated. Please run next commandnpm update caniuse-lite browserslis报错...

-

CSDN博客

头像

解决Vue 项目中的 caniuse-lite 更新提示和 Node.js ERR_OSSL_EVP_UNSUPPORTED 错误

-

CSDN博客

头像

Browserslist: caniuse-lite is outdated. Please run: npx update-browserslist-db@latest Why you should do it regularly: https://github.com/browserslist/update-db#readme

-

博客

头像

Browserslist: caniuse-lite is outdated. Please run the following command: `npm update`

-

51CTO博客

头像

RushJs遇到Browserslist: caniuse-lite is outdated解决方案

-

CSDN博客

头像

项目打包时, 控制台报caniuse-lite is outdated

-

CSDN博客

头像

Vue打包出现Browserslist: caniuse-lite is outdated

-

掘金开发者社区

头像

深入剖析 Browserslist 警告: caniuse-lite 数据库过时的原因与解决方案

-

支付宝开放平台

头像

继续失败,并显示错误“Browserslist: caniuse-lite is lite”

-

腾讯云

头像

前端| 浅析 browserslist 工具

-

Appleex

头像

【前端】vue项目打包Browserslist: caniuse-lite is outdated. Please run: npx update-browserslist-db@latest解决方案

-

阿里云开发者社区

头像

uniapp运行报错Browserslist:caniuse-lite is outdated.Please run:npx browserslist@latest --update-db解决方法

-

CSDN技术社区

头像

Vue.js开发:打包时报错Browserslist: caniuse-lite is outdated. Please run next command `npm update caniuse-lite browserslist` - 我命倾尘 - 博客园

-

博客园

头像

Browserslist: caniuse-lite is outdated. Please run: npx browserslist@latest --update-db

-

帅比KK

头像

组件库自动化脚本:监听构建成功并打开浏览器

-

知乎

头像

Browserslist: caniuse-lite is outdated. Please run: 17:00:29.845 npx update-browserslist-db@latest

-

博客

头像

解决Vue项目报错 Browserslist: caniuse-lite is outdated. Please run: npx update-browserslist-db@latest

-

CSDN技术社区

头像

Browserslist: caniuse-lite is outdated. Please run: 00:26:29.171 npx update-browserslist-db@latest

-

博客

头像

已修复:Browserslist: caniuse-lite is outdated

-

掘金开发者社区

头像

继续失败,并显示错误“Browserslist: caniuse-lite is lite”

-

腾讯云

如何禁止自动更新

在某些情况下,您可能希望禁止软件或库的自动更新功能。以下是一些常见的方法来禁止不同类型的更新:

1. ‌禁止操作系统更新‌

2. ‌禁止应用程序更新‌

3. ‌禁止 npm/yarn 包更新‌

4. ‌禁止 Browserslist 数据库更新‌

Browserslist: caniuse-lite is outdated. Please run: 如果不更新也能用呢,禁止更新

DeepSeek-R1 回答完成

理解问题

头像

头像

头像

搜索全网41篇资料

头像

Browserslist: caniuse-lite is outdated. Please run next commandnpm update caniuse-lite browserslis报错...

-

CSDN博客

头像

深入剖析 Browserslist 警告: caniuse-lite 数据库过时的原因与解决方案

-

CSDN博客

头像

Browserslist: caniuse-lite is outdated. Please run: npx update-browserslist-db@latest Why you should do it regularly: https://github.com/browserslist/update-db#readme

-

博客

头像

Browserslist: caniuse-lite is outdated. Please run the following command: `npm update`

-

51CTO博客

头像

Browserslist: caniuse-lite is outdated

-

CSDN技术社区

头像

项目打包报错“caniuse-lite is outdated. Please run next command `npm update`”的解决方案

-

阿里云开发者社区

头像

Browserslist:caniuse-lite is outdated. Please run next command `npm update`

-

CSDN博客

头像

【报错】Browserslist: caniuse-lite is outdated. Please run: npx update-browserslist-db@latest Why...

-

CSDN博客

头像

Vue.js开发:打包时报错Browserslist: caniuse-lite is outdated. Please run next command `npm update caniuse-lite browserslist` - 我命倾尘 - 博客园

-

博客园

头像

Vue打包出现Browserslist: caniuse-lite is outdated

-

掘金开发者社区

头像

如何关闭系统升级提醒?

-

科技数码百晓通

头像

10月19日教你如何彻底关闭手机系统更新提示

-

度小视

头像

如何关闭手机更新提示,避免烦人推送

-

度小视

头像

如何彻底关闭手机系统更新,避免卡顿和自动安装

-

度小视

头像

你的手机总提示你系统更新怎么办

-

度小视

头像

轻松禁用Microsoft Store自动更新,三步搞定!

-

胆大鬼lucy

头像

1413 如何禁用浏览器自动升级?

-

IT产品及方案专业供应商的技术支持田工

头像

steam客户端自动更新怎么关

-

游戏猎手

头像

如何避免浏览器自动升级影响操作

-

淘淘小八

头像

vivo浏览器总是自动更新

-

IT智库

头像

解决Vue 项目中的 caniuse-lite 更新提示和 Node.js ERR_OSSL_EVP_UNSUPPORTED 错误

-

CSDN博客

头像

Browserslist: caniuse-lite is outdated. Please run: npx browserslist@latest --update-db

-

帅比KK

头像

caniuse-lite is outdated. Please run next command `npm update caniuse-lite browserslist`

-

博客

头像

浏览器列表: caniuse-lite已过时。请运行下一个命令` `npm update caniuse-lite browserslist`

-

腾讯云

头像

项目打包时, 控制台报caniuse-lite is outdated

-

CSDN博客

头像

前端| 浅析 browserslist 工具

-

Appleex

头像

控制台报错:Browserslist: caniuse-lite is outdated.项目启动时控制台报错问题:Br - 掘金

-

掘金开发者社区

头像

TFS任务“运行代码分析”显示错误: Browserslist: caniuse-lite过时了。请运行: npx浏览器列表@最新-更新-db

-

腾讯云

头像

【前端】vue项目打包Browserslist: caniuse-lite is outdated. Please run: npx update-browserslist-db@latest解决方案

-

阿里云开发者社区

头像

在执行前端VUE项目时遇到的一些问题

-

行者-阳

头像

组件库自动化脚本:监听构建成功并打开浏览器

-

知乎

头像

uniapp运行报错Browserslist:caniuse-lite is outdated.Please run:npx browserslist@latest --update-db解决方法

-

CSDN技术社区

头像

已修复:Browserslist: caniuse-lite is outdated

-

掘金开发者社区

头像

华为手机怎么关闭系统更新通知

-

波段老哥

头像

如何关闭App更新提示,让通知栏更清爽?

-

度小视

头像

苹果自动更新软件在哪里关闭

-

好看视频

头像

怎么让iphone不提醒更新系统

-

百度本地生活

头像

iOS屏蔽更新!亲测有效

-

上岸的Eve追风

头像

如何关闭系统升级提醒

-

好看视频

头像

antd项目安装依赖时出现“caniuse-lite is outdated”并卡死问题的解决方案

-

CSDN博客

头像

如何关闭系统升级提醒?,数码,手机,好看视频

-

科技数码人生

如何禁止 caniuse-lite 的更新提示

在某些情况下,即使 caniuse-lite 数据库过时,你可能仍然希望继续使用当前的版本,而不希望看到更新提示。虽然通常建议保持依赖项最新以确保兼容性和安全性,但如果你有特定理由需要禁止更新,以下是一些方法:

1. ‌忽略更新提示‌

2. ‌锁定依赖版本‌

3. ‌自定义脚本‌

4. ‌联系工具维护者‌

注意事项

因此,在决定禁止更新之前,请仔细权衡利弊,并确保你了解可能带来的后果。

如果你想禁止 caniuse-lite 的更新提示,可以采取以下几种方法:

‌1. 忽略警告(不推荐)‌

caniuse-lite 的警告不会影响项目的正常运行,只是提醒你浏览器兼容性数据可能不是最新的。你可以选择忽略它,但可能会导致某些 CSS/JS 兼容性判断不准确‌12。

‌2. 锁定版本‌

在 package.json 中手动锁定 caniuse-lite 和 browserslist 的版本,避免自动更新:

jsonCopy Code"resolutions": {
  "caniuse-lite": "1.0.30001234",
  "browserslist": "4.21.0"}

(适用于 Yarn,如果是 npm,可以使用 npm shrinkwrap 或 package-lock.json 锁定版本)‌34。

‌3. 删除警告提示‌

修改 node_modules/browserslist 的源码,屏蔽警告:

  1. 找到 node_modules/browserslist/index.js

  2. 注释掉或删除以下代码:

javascriptCopy Codeif (process.env.BROWSERSLIST_IGNORE_OLD_DATA !== 'true') {  console.warn('Browserslist: caniuse-lite is outdated...');
}

(需在每次 npm install 后重新修改)‌15。

‌4. 设置环境变量‌

在运行项目时添加环境变量,禁止警告:

bashCopy CodeBROWSERSLIST_IGNORE_OLD_DATA=true npm run dev

或在 .env 文件中添加:

textCopy CodeBROWSERSLIST_IGNORE_OLD_DATA=true

(部分工具链支持该变量)‌26。

‌5. 完全移除 caniuse-lite(极端情况)‌

如果项目不需要浏览器兼容性检测(如仅用于 Node.js 后端),可以直接卸载:

bashCopy Codenpm uninstall caniuse-lite browserslist

但可能导致依赖它们的工具(如 Autoprefixer、Babel)报错‌78。


‌注意‌:禁止更新可能导致某些 CSS 前缀或 JS 转译规则不准确,建议仅在测试环境使用上述方法,生产环境仍应定期更新‌12。

10% building 2/2 modules 0 activeError: error:0308010C:digital envelope routines::unsupported    at new Hash (node:internal/crypto/hash:71:19)    at Object.createHash (node:crypto:133:10)

DeepSeek-R1 回答完成

理解问题

头像

头像

头像

搜索全网20篇资料

头像

快速解决Error: error:0308010C:digital envelope routines::unsupported的三种解决方案

-

张三

头像

【无标题】yarn serve 报 10% building 2/2 modules 0 activeError: error:0308010C:digital envelope routines:

-

CSDN博客

头像

10% building 2/2 modules 0 activeError: error:0308010C:digital envelope routines::unsupported

-

博客

头像

error:0308010C:digital envelope routines::unsupported

-

博客园

头像

10% building 2/2 modules 0 activeError: error:0308010C:digital envelope rout

-

51CTO博客

头像

快速解决Error: error:0308010C:digital envelope routines::unsupported的三种解决方案

-

脚本之家

头像

解决Error: error:0308010C:digital envelope routines::unsupported的四种解决方案

-

博客园

头像

Node——activeError: error:0308010C:digital envelope routines::unsupported

-

腾讯云

头像

【已解决】Error: error:0308010C:digital envelope routines::unsupported

-

阿里云开发者社区

头像

主要报错:10% building 2/2 modules 0 activeError: error:0308010C:digital envelope rout-CSDN博客

-

CSDN博客

头像

Error: error:0308010C:digital envelope routines::unsupported

-

CSDN博客

头像

npm运行Vue项目报错 error:0308010c:digital envelope routines::unsupported

-

CSDN博客

头像

error:03000086:digital envelope routines::initialization error 问题解决

-

CSDN技术社区

头像

Yarn 安装的时候提示错误 error:0308010C:digital envelope routines

-

HoneyMoose

头像

vue-cli-service 报错 Error: error:0308010C:digital envelope routines::unsupported

-

伍哥的传说

头像

OpenSSL报错:activeError: error:0308010C:digital envelope routines::unsupported怎么办?

-

CSDN问答

头像

npm run serve 报错Error: error:0308010C:digital envelope routines::unsupported

-

博客园

头像

Error: error:0308010C:digital envelope routines::unsupported 问题解决

-

知乎

头像

Node.js更新到17版本后应用启动报错“error:0308010C:digital envelope routines::unsupported”问题的解决

-

华为开发者联盟

头像

[转]Node.js更新到17版本后应用启动报错“error:0308010C:digital envelope routines::unsupported”问题的解决

-

博客园

该错误是由于 Node.js V17+ 版本引入的 OpenSSL 3.0 对加密算法的严格限制导致的兼容性问题13。以下是具体解决方案:

一、临时解决方案(推荐)

  1. ‌设置环境变量‌
    在运行命令前添加以下环境变量:

    bashCopy Code# Linux/Macexport NODE_OPTIONS=--openssl-legacy-provider# Windows (CMD)set NODE_OPTIONS=--openssl-legacy-provider# Windows (PowerShell)$env:NODE_OPTIONS="--openssl-legacy-provider"

    此方法可绕过 OpenSSL 3.0 的限制16。

  2. ‌修改启动脚本‌
    在 package.json 的 scripts 中直接注入环境变量:

    jsonCopy Code"scripts": {
      "dev": "set NODE_OPTIONS=--openssl-legacy-provider && vite dev"}

二、长期解决方案

  1. ‌降级 Node.js 版本‌
    建议切换至 Node.js 16.x LTS 版本(如 16.20.2):

    bashCopy Codenvm install 16.20.2
    nvm use 16.20.2

    16.x 版本仍使用 OpenSSL 1.1.1,无此限制38。

  2. ‌更新项目依赖‌
    若项目较老,升级以下依赖可能解决问题:

    bashCopy Codenpm update webpack webpack-dev-server @vue/cli-service

三、其他注意事项

建议优先采用‌临时解决方案‌,若需彻底解决则降级 Node.js 版本13。

error  in ./src/assets/css/main.sass Error: Missing binding C:\Workscg\gansu-njnb\node_modules\node-sass\vendor\win32-x64-83\binding.node Node Sass could not find a binding for your current environment: Windows 64-bit with Node.js 14.x Found bindings for the following environments:  - Windows 64-bit with Node.js 12.x

DeepSeek-R1 回答完成

理解问题

头像

头像

头像

搜索全网20篇资料

头像

error in ./src/assets/css/element-variables.scss

-

CSDN博客

头像

解决:Error: Missing binding xxxxx\node_modules\node-sass\vendor\win32-x64-83\

-

CSDN博客

头像

vue如何引入scss报错

-

Worktile

头像

module not found: error: can't resolve 'sass-loader'

-

腾讯云

头像

使用CSS-in-JS

-

博客园

头像

node-sass安装失败解决方法,终有一款适合我们

-

CSDN技术社区

头像

如何解决wasnode节点启动报错问题?

-

blog.huochengrm.cn

头像

关于vue项目中的臭恶 node-sass 安装报错问题解决

-

掘金开发者社区

头像

Syntax Error: Error: Cannot find module ‘sass‘

-

CSDN博客

头像

新版sass报错

-

CSDN博客

头像

axios in ./src/main.js Failed to resolve loader: sass-loader

-

51CTO博客

头像

关于windows 下 node_modules\node-sass\vendor 的报错解决方法

-

博客园

头像

[vite] Internal server error: [sass] Can't find stylesheet to import.

-

博客

头像

又报gyp ERR!为什么有那么多人被node-sass 坑过?

-

稀土掘金

头像

为什么node-sass总是安装失败?node-sass是我们开发中很常见的依赖包,也是安装时间冗长和最常见到报错的依赖 - 掘金

-

掘金开发者社区

头像

vue我安装了sass为什么显示错误

-

Worktile

头像

error when starting dev server: Error: Failed to resolve vue/compiler-sfc.

-

博客

头像

uniapp发布快应用失败报错以及hap-chimera-toolkit问题卓伊凡

-

卓伊凡

头像

问题:npm 6.14.13 安装 node-sass 报错如何解决?

-

CSDN问答

头像

微信开放社区

-

微信开放社区

这个错误是由于 node-sass 的绑定文件与当前 Node.js 版本不匹配导致的。以下是详细的解决方案:

‌1. 检查 Node.js 版本兼容性‌

错误信息显示当前环境是 ‌Node.js 14.x‌,但 node-sass 仅支持 ‌Node.js 12.x‌。你需要:

‌2. 重新构建 node-sass 绑定文件‌

如果版本正确但绑定文件缺失,执行以下命令:

bashCopy Codenpm rebuild node-sass --force

这会重新编译本地绑定文件‌23。

‌3. 清除缓存并重新安装依赖‌

缓存或依赖损坏可能导致此问题:

bashCopy Codenpm cache clean --forcerm -rf node_modules package-lock.json
npm install

确保网络稳定,必要时使用淘宝镜像加速安装‌34。

‌4. 替换 node-sass 为 sass(推荐长期方案)‌

node-sass 已弃用,建议迁移到 sass(Dart Sass):

bashCopy Codenpm uninstall node-sass
npm install sass --save-dev

然后修改项目配置(如 webpack.config.js 或 vite.config.ts),将 sass-loader 的 implementation 指向 sass‌56。

‌5. 检查文件路径与配置‌

‌总结‌

优先尝试 ‌降级 Node.js‌ 或 ‌替换为 sass‌,若问题仍存在,按步骤排查缓存、依赖和配置问题‌12。

node-sass和sass有什么区别?

如何确认降级Node.js是否成功?

如何检查项目是否已安装 `sass-loader`?